Reaction Details
TargetAurora kinase A
LigandBDBM50315852
Substrate/Competitorn/a
Meas. Tech.ChEMBL_624739 (CHEMBL1113415)
IC50 1700±n/a nM
Citation Blanchard, SWilliam, ADLee, ACPoulsen, ATeo, ELDeng, WTu, NTan, EGoh, KLOng, WCNg, CPGoh, KCBonday, ZSun, ET Synthesis and evaluation of alkenyl indazoles as selective Aurora kinase inhibitors. Bioorg Med Chem Lett20:2443-7 (2010) 
 
Aurora kinase A
Name:Aurora kinase A
Type:Serine/threonine-protein kinase
Mol. Mass.:45830.98
Organism:Homo sapiens (Human)
Description:O14965
Residue:403
BDBM50315852
NameBDBM50315852
Synonyms:CHEMBL1090910 | N-(3-phenethyl-1H-indazol-5-yl)-2-phenylacetamide
TypeSmall organic molecule
Emp. Form.C23H21N3O
Mol. Mass.355.4323
SMILESO=C(Cc1ccccc1)Nc1ccc2[nH]nc(CCc3ccccc3)c2c1