Reaction Details
TargetAdenosine receptor A1
LigandBDBM50315853
Substrate/Competitorn/a
Meas. Tech.ChEMBL_625531 (CHEMBL1107963)
Ki 347±n/a nM
Citation Narlawar, RLane, JRDoddareddy, MLin, JBrussee, JIjzerman, AP Hybrid ortho/allosteric ligands for the adenosine A(1) receptor. J Med Chem53:3028-37 (2010) 
 
Adenosine receptor A1
Name:Adenosine receptor A1
Type:G Protein-Coupled Receptor (GPCR)
Mol. Mass.:36520.92
Organism:Homo sapiens (Human)
Description:P30542
Residue:326
BDBM50315853
NameBDBM50315853
Synonyms:6-[2-Amino-3-(3,4-dichlorobenzoyl)-4,5,6,7-tetrahydrothieno-[2,3-c]pyridin-6-yl-7-heptyloxy-4-phenyl]-adenosine | CHEMBL1090685
TypeSmall organic molecule
Emp. Form.C37H41Cl2N7O6S
Mol. Mass.782.736
SMILESNc1sc2CN(CCCCCCCOc3ccc(Nc4ncnc5n(cnc45)[C@@H]4O[C@H](CO)[C@@H](O)[C@H]4O)cc3)CCc2c1C(=O)c1ccc(Cl)c(Cl)c1