Reaction Details
TargetAdenosine receptor A1
LigandBDBM50315857
Substrate/Competitorn/a
Meas. Tech.ChEMBL_625539 (CHEMBL1107971)
EC50 22±n/a nM
Citation Narlawar, RLane, JRDoddareddy, MLin, JBrussee, JIjzerman, AP Hybrid ortho/allosteric ligands for the adenosine A(1) receptor. J Med Chem53:3028-37 (2010) 
 
Adenosine receptor A1
Name:Adenosine receptor A1
Type:G Protein-Coupled Receptor (GPCR)
Mol. Mass.:36520.92
Organism:Homo sapiens (Human)
Description:P30542
Residue:326
BDBM50315857
NameBDBM50315857
Synonyms:(2R,3S,4R,5R)-2-(hydroxymethyl)-5-(6-(4-methoxyphenylamino)-9H-purin-9-yl)tetrahydrofuran-3,4-diol | CHEMBL1093910
TypeSmall organic molecule
Emp. Form.C17H19N5O5
Mol. Mass.373.3633
SMILESCOc1ccc(Nc2ncnc3n(cnc23)[C@@H]2O[C@H](CO)[C@@H](O)[C@H]2O)cc1