Reaction Details
TargetAdenosine receptor A1
LigandBDBM50315859
Substrate/Competitorn/a
Meas. Tech.ChEMBL_625530 (CHEMBL1107962)
Ki 417±n/a nM
Citation Narlawar, RLane, JRDoddareddy, MLin, JBrussee, JIjzerman, AP Hybrid ortho/allosteric ligands for the adenosine A(1) receptor. J Med Chem53:3028-37 (2010) 
 
Adenosine receptor A1
Name:Adenosine receptor A1
Type:G Protein-Coupled Receptor (GPCR)
Mol. Mass.:36520.92
Organism:Homo sapiens (Human)
Description:P30542
Residue:326
BDBM50315859
NameBDBM50315859
Synonyms:CHEMBL1090681 | N6-[2-Amino-3-(3,4-dichlorobenzoyl)-4,5,6,7-tetrahydrothieno-[2,3-c]pyridin-6-yl-3-propyloxy-4-phenyl]-adenosine
TypeSmall organic molecule
Emp. Form.C33H33Cl2N7O6S
Mol. Mass.726.629
SMILESNc1sc2CN(CCCOc3ccc(Nc4ncnc5n(cnc45)[C@@H]4O[C@H](CO)[C@@H](O)[C@H]4O)cc3)CCc2c1C(=O)c1ccc(Cl)c(Cl)c1