Reaction Details
TargetAdenosine receptor A1
LigandBDBM50080550
Substrate/Competitorn/a
Meas. Tech.ChEMBL_625528 (CHEMBL1107960)
EC50 1738±n/a nM
Citation Narlawar, RLane, JRDoddareddy, MLin, JBrussee, JIjzerman, AP Hybrid ortho/allosteric ligands for the adenosine A(1) receptor. J Med Chem53:3028-37 (2010) 
 
Adenosine receptor A1
Name:Adenosine receptor A1
Type:G Protein-Coupled Receptor (GPCR)
Mol. Mass.:36520.92
Organism:Homo sapiens (Human)
Description:P30542
Residue:326
BDBM50080550
NameBDBM50080550
Synonyms:(2-Amino-4,5-dimethyl-thiophen-3-yl)-(3-trifluoromethyl-phenyl)-methanone (2-amino-4,5-dimethylthien-3-yl)-[3-(trifluoromethyl)phenyl]-methanone CHEMBL59532 | PD-81723
TypeSmall organic molecule
Emp. Form.C14H12F3NOS
Mol. Mass.299.311
SMILESCc1sc(N)c(C(=O)c2cccc(c2)C(F)(F)F)c1C