Reaction Details
TargetAdenosine receptor A1
LigandBDBM50315864
Substrate/Competitorn/a
Meas. Tech.ChEMBL_625528 (CHEMBL1107960)
EC50 3700±n/a nM
Citation Narlawar, RLane, JRDoddareddy, MLin, JBrussee, JIjzerman, AP Hybrid ortho/allosteric ligands for the adenosine A(1) receptor. J Med Chem53:3028-37 (2010) 
 
Adenosine receptor A1
Name:Adenosine receptor A1
Type:G Protein-Coupled Receptor (GPCR)
Mol. Mass.:36520.92
Organism:Homo sapiens (Human)
Description:P30542
Residue:326
BDBM50315864
NameBDBM50315864
Synonyms:2-Amino-6-[3-(4-nitrophenoxy)-propyl]-4,5,6,7-tetrahydrothieno[2,3-c]pyridin-3-yl-(3,4-dichlorophenyl)-methanone | CHEMBL1093487
TypeSmall organic molecule
Emp. Form.C23H21Cl2N3O4S
Mol. Mass.506.402
SMILESNc1sc2CN(CCCOc3ccc(cc3)[N+]([O-])=O)CCc2c1C(=O)c1ccc(Cl)c(Cl)c1