Reaction Details
TargetC-C chemokine receptor type 2
LigandBDBM50315998
Substrate/Competitorn/a
Meas. Tech.ChEMBL_625751 (CHEMBL1104428)
IC50 0.3±n/a nM
Citation Cherney, RJMo, RMeyer, DTVoss, MEYang, MGSantella, JBDuncia, JVLo, YCYang, GMiller, PBScherle, PAZhao, QMandlekar, SCvijic, MEBarrish, JCDecicco, CPCarter, PH gamma-Lactams as glycinamide replacements in cyclohexane-based CC chemokine receptor 2 (CCR2) antagonists. Bioorg Med Chem Lett20:2425-30 (2010) 
 
C-C chemokine receptor type 2
Name:C-C chemokine receptor type 2
Type:Enzyme
Mol. Mass.:41932.32
Organism:Homo sapiens (Human)
Description:P41597
Residue:374
BDBM50315998
NameBDBM50315998
Synonyms:CHEMBL1090893 | N-((S)-1-((1S,2R,4R)-4-(ethyl(isopropyl)amino)-2-(phenylsulfonylmethyl)cyclohexyl)-2-oxopyrrolidin-3-yl)-3-(trifluoromethyl)benzamide
TypeSmall organic molecule
Emp. Form.C30H38F3N3O4S
Mol. Mass.593.701
SMILESCCN(C(C)C)[C@@H]1CC[C@@H]([C@H](CS(=O)(=O)c2ccccc2)C1)N1CC[C@H](NC(=O)c2cccc(c2)C(F)(F)F)C1=O