Reaction Details
TargetPhosphatidylinositol 4,5-bisphosphate 3-kinase catalytic subunit alpha isoform
LigandBDBM50316264
Substrate/Competitorn/a
Meas. Tech.ChEMBL_628492 (CHEMBL1104614)
IC50 80±n/a nM
Citation Verheijen, JCRichard, DJCurran, KKaplan, JLefever, MNowak, PMalwitz, DJBrooijmans, NToral-Barza, LZhang, WGLucas, JHollander, IAyral-Kaloustian, SMansour, TSYu, KZask, A Discovery of 4-morpholino-6-aryl-1H-pyrazolo[3,4-d]pyrimidines as highly potent and selective ATP-competitive inhibitors of the mammalian target of rapamycin (mTOR): optimization of the 6-aryl substituent. J Med Chem52:8010-24 (2009) 
 
Phosphatidylinositol 4,5-bisphosphate 3-kinase catalytic subunit alpha isoform
Name:Phosphatidylinositol 4,5-bisphosphate 3-kinase catalytic subunit alpha isoform
Type:Enzyme Subunit
Mol. Mass.:124294.87
Organism:Homo sapiens (Human)
Description:P42336
Residue:1068
BDBM50316264
NameBDBM50316264
Synonyms:CHEMBL1095933 | tert-Butyl 4-(6-(4-(3-Methylureido)phenyl)-4-morpholino-1Hpyrazolo[3,4-d]pyrimidin-1-yl)piperidine-1-carboxylate
TypeSmall organic molecule
Emp. Form.C27H36N8O4
Mol. Mass.536.6259
SMILESCNC(=O)Nc1ccc(cc1)-c1nc(N2CCOCC2)c2cnn(C3CCN(CC3)C(=O)OC(C)(C)C)c2n1