Reaction Details
TargetSerine/threonine-protein kinase mTOR
LigandBDBM50316277
Substrate/Competitorn/a
Meas. Tech.ChEMBL_628491 (CHEMBL1104613)
IC50 145±n/a nM
Citation Verheijen, JCRichard, DJCurran, KKaplan, JLefever, MNowak, PMalwitz, DJBrooijmans, NToral-Barza, LZhang, WGLucas, JHollander, IAyral-Kaloustian, SMansour, TSYu, KZask, A Discovery of 4-morpholino-6-aryl-1H-pyrazolo[3,4-d]pyrimidines as highly potent and selective ATP-competitive inhibitors of the mammalian target of rapamycin (mTOR): optimization of the 6-aryl substituent. J Med Chem52:8010-24 (2009) 
 
Serine/threonine-protein kinase mTOR
Name:Serine/threonine-protein kinase mTOR
Type:Rapamycin target protein
Mol. Mass.:288917.12
Organism:Homo sapiens (Human)
Description:P42345
Residue:2549
BDBM50316277
NameBDBM50316277
Synonyms:6-(4-morpholino-1-phenyl-1H-pyrazolo[3,4-d]pyrimidin-6-yl)pyridin-3-amine | CHEMBL1098311
TypeSmall organic molecule
Emp. Form.C20H19N7O
Mol. Mass.373.4112
SMILESNc1ccc(nc1)-c1nc(N2CCOCC2)c2cnn(-c3ccccc3)c2n1