Reaction Details
TargetAldo-keto reductase family 1 member B1
LigandBDBM50133496
Substrate/Competitorn/a
Meas. Tech.ChEMBL_627900 (CHEMBL1103716)
IC50 3910±n/a nM
Citation Koukoulitsa, CBailly, FPegklidou, KDemopoulos, VJCotelle, P Evaluation of aldose reductase inhibition and docking studies of 6'-nitro and 6',6''-dinitrorosmarinic acids. Eur J Med Chem45:1663-6 (2010) 
 
Aldo-keto reductase family 1 member B1
Name:Aldo-keto reductase family 1 member B1
Type:Protein
Mol. Mass.:35855.50
Organism:Homo sapiens (Human)
Description:P15121. 4LAU; 2IKI; 4LB4; 2FZD; 2FZ8; 1US0
Residue:316
BDBM50133496
NameBDBM50133496
Synonyms:(2R)-3-(3,4-dihydroxyphenyl)-2-[(2E)-3-(3,4-dihydroxyphenyl)prop-2-enoyloxy]propanoic acid CHEMBL324842 US10688093, Compound rosmarinic acid cid_5281792
TypeSmall organic molecule
Emp. Form.C18H16O8
Mol. Mass.360.3148
SMILESOC(=O)[C@@H](Cc1ccc(O)c(O)c1)OC(=O)\C=C\c1ccc(O)c(O)c1