Reaction Details
TargetHyaluronidase-1
LigandBDBM50241245
Substrate/Competitorn/a
Meas. Tech.ChEMBL_628271 (CHEMBL1111859)
IC50>2000000±n/a nM
Citation Iwanaga, AKusano, GWarashina, TMiyase, T Phenolic constituents of the aerial parts of Cimicifuga simplex and Cimicifuga japonica. J Nat Prod73:609-12 (2010) 
 
Hyaluronidase-1
Name:Hyaluronidase-1
Type:Protein
Mol. Mass.:48369.09
Organism:Homo sapiens (Human)
Description:Q1279
Residue:435
BDBM50241245
NameBDBM50241245
Synonyms:(2E)-3-(3-hydroxy-4-methoxyphenyl)prop-2-enoic acid CHEMBL233295 isoferulic acid
TypeSmall organic molecule
Emp. Form.C10H10O4
Mol. Mass.194.184
SMILESCOc1ccc(\C=C\C(O)=O)cc1O