Reaction Details
TargetPhospholipase A2, major isoenzyme
LigandBDBM50316458
Substrate/Competitorn/a
Meas. Tech.ChEMBL_630281 (CHEMBL1108229)
IC50 7400±n/a nM
Citation Meddad-Belhabich, NAoun, DDjimdé, ARedeuilh, CDive, GMassicot, FChau, FHeymans, FLamouri, A Design of new potent and selective secretory phospholipase A(2) inhibitors. 6-Synthesis, structure-activity relationships and molecular modelling of 1-substituted-4-[4,5-dihydro-1,2,4-(4H)-oxadiazol-5-one-3-yl(methyl)]-functionalized aryl piperazin/one/dione derivatives. Bioorg Med Chem18:3588-600 (2010) 
 
Phospholipase A2, major isoenzyme
Name:Phospholipase A2, major isoenzyme
Type:Hydrolase; monomer or homodimer
Mol. Mass.:16279.83
Organism:Sus scrofa (pig)
Description:Purchased from Sigma.
Residue:146
BDBM50316458
NameBDBM50316458
Synonyms:1-[4-(4,5-Dihydro-1,2,4-(4H)-5-oxo-oxadiazol-3-ylmethyl)benzoyl]-4-(4-octadecyl oxyphenyl)piperazine | CHEMBL1099341
TypeSmall organic molecule
Emp. Form.C38H56N4O4
Mol. Mass.632.8756
c1ccc(cc1)N1CCN(CC1)C(=O)c1ccc(Cc2nc(=O)o[nH]2)cc1