Reaction Details
TargetNitric oxide synthase, inducible
LigandBDBM50316608
Substrate/Competitorn/a
Meas. Tech.ChEMBL_631957 (CHEMBL1104713)
IC50 65000±n/a nM
Citation Ilies, MDi Costanzo, LNorth, MLScott, JAChristianson, DW 2-aminoimidazole amino acids as inhibitors of the binuclear manganese metalloenzyme human arginase I. J Med Chem53:4266-76 (2010) 
 
Nitric oxide synthase, inducible
Name:Nitric oxide synthase, inducible
Type:Enzyme
Mol. Mass.:130595.79
Organism:Mus musculus (mouse)
Description:Recombinant enzyme overexpressed in E. coli.
Residue:1144
BDBM50316608
NameBDBM50316608
Synonyms:1H-Imidazol-2-yl-ammonium 1H-imidazol-2-amine CHEMBL2392115 | CHEMBL291627
TypeSmall organic molecule
Emp. Form.C3H5N3
Mol. Mass.83.0919
SMILESNc1ncc[nH]1