Reaction Details
TargetAdenosine receptor A1
LigandBDBM50316847
Substrate/Competitorn/a
Meas. Tech.ChEMBL_632846 (CHEMBL1112852)
Ki 6±n/a nM
Citation Sirisha, BNarsaiah, BYakaiah, TGayatri, GSastry, GNPrasad, MRRao, AR Synthesis and theoretical studies on energetics of novel N- and O- perfluoroalkyl triazole tagged thienopyrimidines--their potential as adenosine receptor ligands. Eur J Med Chem45:1739-45 (2010) 
 
Adenosine receptor A1
Name:Adenosine receptor A1
Type:Protein
Mol. Mass.:36704.13
Organism:Rattus norvegicus (rat)
Description:n/a
Residue:326
BDBM50316847
NameBDBM50316847
Synonyms:2,5,6-Trimethyl-3-prop-2-yn-1-ylthieno[2,3-d]pyrimidin-4(3H)-one | CHEMBL1095693
TypeSmall organic molecule
Emp. Form.C12H12N2OS
Mol. Mass.232.301
SMILESCc1sc2nc(C)n(CC#C)c(=O)c2c1C