Reaction Details
TargetAdenosine receptor A1
LigandBDBM50316850
Substrate/Competitorn/a
Meas. Tech.ChEMBL_632846 (CHEMBL1112852)
Ki 6±n/a nM
Citation Sirisha, BNarsaiah, BYakaiah, TGayatri, GSastry, GNPrasad, MRRao, AR Synthesis and theoretical studies on energetics of novel N- and O- perfluoroalkyl triazole tagged thienopyrimidines--their potential as adenosine receptor ligands. Eur J Med Chem45:1739-45 (2010) 
 
Adenosine receptor A1
Name:Adenosine receptor A1
Type:Protein
Mol. Mass.:36704.13
Organism:Rattus norvegicus (rat)
Description:n/a
Residue:326
BDBM50316850
NameBDBM50316850
Synonyms:2-Methyl-3-prop-2-yn-1-yl-3,5,6,7-tetrahydro-4H-cyclopenta[4,5]thieno[2,3-d]pyrimidin-4-one | CHEMBL1095695
TypeSmall organic molecule
Emp. Form.C13H12N2OS
Mol. Mass.244.312
SMILESCc1nc2sc3CCCc3c2c(=O)n1CC#C