Reaction Details
TargetAdenosine receptor A2a
LigandBDBM50316846
Substrate/Competitorn/a
Meas. Tech.ChEMBL_632847 (CHEMBL1112853)
Ki 14±n/a nM
Citation Sirisha, BNarsaiah, BYakaiah, TGayatri, GSastry, GNPrasad, MRRao, AR Synthesis and theoretical studies on energetics of novel N- and O- perfluoroalkyl triazole tagged thienopyrimidines--their potential as adenosine receptor ligands. Eur J Med Chem45:1739-45 (2010) 
 
Adenosine receptor A2a
Name:Adenosine receptor A2a
Type:G Protein-Coupled Receptor (GPCR)
Mol. Mass.:45015.65
Organism:Rattus norvegicus (rat)
Description:Rat A2A receptors expressed in CHO cells.
Residue:410
BDBM50316846
NameBDBM50316846
Synonyms:2-(4-Fluorobenzyl)-3-prop-2-yn-1-yl-5,6,7,8-tetrahydro[1]benzothieno[2,3-d]pyrimidin-4(3H)-one | CHEMBL1088253
TypeSmall organic molecule
Emp. Form.C20H17FN2OS
Mol. Mass.352.425
SMILESFc1ccc(Cc2nc3sc4CCCCc4c3c(=O)n2CC#C)cc1