Reaction Details
TargetAdenosine receptor A2a
LigandBDBM50316849
Substrate/Competitorn/a
Meas. Tech.ChEMBL_632847 (CHEMBL1112853)
Ki 7620±n/a nM
Citation Sirisha, BNarsaiah, BYakaiah, TGayatri, GSastry, GNPrasad, MRRao, AR Synthesis and theoretical studies on energetics of novel N- and O- perfluoroalkyl triazole tagged thienopyrimidines--their potential as adenosine receptor ligands. Eur J Med Chem45:1739-45 (2010) 
 
Adenosine receptor A2a
Name:Adenosine receptor A2a
Type:G Protein-Coupled Receptor (GPCR)
Mol. Mass.:45015.65
Organism:Rattus norvegicus (rat)
Description:Rat A2A receptors expressed in CHO cells.
Residue:410
BDBM50316849
NameBDBM50316849
Synonyms:2-(4-Fluorobenzyl)-5,6-dimethyl-3-prop-2-yn-1-ylthieno[2,3-d]pyrimidin-4(3H)-one | CHEMBL1088384
TypeSmall organic molecule
Emp. Form.C18H15FN2OS
Mol. Mass.326.388
SMILESCc1sc2nc(Cc3ccc(F)cc3)n(CC#C)c(=O)c2c1C