Reaction Details
TargetAdenosine receptor A2a
LigandBDBM50316851
Substrate/Competitorn/a
Meas. Tech.ChEMBL_632847 (CHEMBL1112853)
Ki 9700±n/a nM
Citation Sirisha, BNarsaiah, BYakaiah, TGayatri, GSastry, GNPrasad, MRRao, AR Synthesis and theoretical studies on energetics of novel N- and O- perfluoroalkyl triazole tagged thienopyrimidines--their potential as adenosine receptor ligands. Eur J Med Chem45:1739-45 (2010) 
 
Adenosine receptor A2a
Name:Adenosine receptor A2a
Type:G Protein-Coupled Receptor (GPCR)
Mol. Mass.:45015.65
Organism:Rattus norvegicus (rat)
Description:Rat A2A receptors expressed in CHO cells.
Residue:410
BDBM50316851
NameBDBM50316851
Synonyms:2-Phenyl-3-prop-2-yn-1-yl-3,5,6,7-tetrahydro-4H-cyclopenta[4,5]thieno[2,3-d]pyrimidine-4-one | CHEMBL1087329
TypeSmall organic molecule
Emp. Form.C18H14N2OS
Mol. Mass.306.382
SMILESO=c1n(CC#C)c(nc2sc3CCCc3c12)-c1ccccc1