Reaction Details
TargetCyclin-dependent kinase 2/G1/S-specific cyclin-E1
LigandBDBM50317169
Substrate/Competitorn/a
Meas. Tech.ChEMBL_631113 (CHEMBL1103822)
IC50 1.7±n/a nM
Citation Choi, SJLee, JEJeong, SYIm, ILee, SDLee, EJLee, SKKwon, SMAhn, SGYoon, JHHan, SYKim, JIKim, YC 5,5'-substituted indirubin-3'-oxime derivatives as potent cyclin-dependent kinase inhibitors with anticancer activity. J Med Chem53:3696-706 (2010) 
 
Cyclin-dependent kinase 2/G1/S-specific cyclin-E1
Name:Cyclin-dependent kinase 2/G1/S-specific cyclin-E1
Type:Protein
Mol. Mass.:n/a
Description:n/a
Components:This complex has 2 components.
Component 1
Name:Cyclin-dependent kinase 2
Synonyms:CDK2 CDK2_HUMAN Cell division protein kinase 2 Protein cereblon/Cyclin-dependent kinase 2 | p33 protein kinase
Type:Enzyme Subunit
Mol. Mass.:33938.17
Organism:Homo sapiens (Human)
Description:P24941
Residue:298
Component 2
Name:G1/S-specific cyclin-E1
Synonyms:CCNE CCNE1_HUMAN
Type:Enzyme Subunit
Mol. Mass.:47073.17
Organism:Homo sapiens (Human)
Description:n/a
Residue:410
BDBM50317169
NameBDBM50317169
Synonyms:(2'Z,3'E)-5-Nitro-5'-fluoro-indirubin-3'-oxime | CHEMBL1087073
TypeSmall organic molecule
Emp. Form.C16H9FN4O4
Mol. Mass.340.2655
SMILES[O-][N+](=O)c1ccc2[nH]c(=O)[c-](-c3[nH]c4ccc(F)cc4c3N=[OH+])c2c1