Reaction Details
TargetAurora kinase A
LigandBDBM50317161
Substrate/Competitorn/a
Meas. Tech.ChEMBL_631118 (CHEMBL1106490)
IC50 1000±n/a nM
Citation Choi, SJLee, JEJeong, SYIm, ILee, SDLee, EJLee, SKKwon, SMAhn, SGYoon, JHHan, SYKim, JIKim, YC 5,5'-substituted indirubin-3'-oxime derivatives as potent cyclin-dependent kinase inhibitors with anticancer activity. J Med Chem53:3696-706 (2010) 
 
Aurora kinase A
Name:Aurora kinase A
Type:Serine/threonine-protein kinase
Mol. Mass.:45830.98
Organism:Homo sapiens (Human)
Description:O14965
Residue:403
BDBM50317161
NameBDBM50317161
Synonyms:(2'Z,3'E)-5-Nitro-5'-hydroxy-indirubin-3'-oxime | CHEMBL1088704
TypeSmall organic molecule
Emp. Form.C16H10N4O5
Mol. Mass.338.2744
SMILESOc1ccc2[nH]c(c(N=[OH+])c2c1)-[c-]1c2cc(ccc2[nH]c1=O)[N+]([O-])=O