Reaction Details
TargetGlutamate receptor ionotropic, NMDA 1/2A
LigandBDBM50317187
Substrate/Competitorn/a
Meas. Tech.ChEMBL_631316 (CHEMBL1105653)
IC50 29400±n/a nM
Citation Rook, YSchmidtke, KUGaube, FSchepmann, DWünsch, BHeilmann, JLehmann, JWinckler, T Bivalent beta-carbolines as potential multitarget anti-Alzheimer agents. J Med Chem53:3611-7 (2010) 
 
Glutamate receptor ionotropic, NMDA 1/2A
Name:Glutamate receptor ionotropic, NMDA 1/2A
Type:Protein
Mol. Mass.:n/a
Description:n/a
Components:This complex has 2 components.
Component 1
Name:Glutamate receptor ionotropic, NMDA 1
Synonyms:GRIN1 Glutamate [NMDA] receptor subunit zeta-1 N-methyl-D-aspartate receptor subunit NR1 NMDZ1_HUMAN | phencyclidine
Type:Enzyme Catalytic Domain
Mol. Mass.:105397.81
Organism:Homo sapiens (Human)
Description:Q05586
Residue:938
Component 2
Name:Glutamate receptor ionotropic, NMDA 2A
Synonyms:GRIN2A Glutamate [NMDA] receptor Glutamate [NMDA] receptor subunit epsilon-1 NMDA receptor subtype 2A protein (NR2A) NMDE1_HUMAN hNR2A
Type:n/a
Mol. Mass.:165293.76
Organism:Homo sapiens (Human)
Description:n/a
Residue:1464
BDBM50317187
NameBDBM50317187
Synonyms:6-Methoxy-2-[5-(6-methoxy-beta-carboline-2-ium-2-yl)pentyl]-beta-carboline-2-ium dibromide | CHEMBL1094554
TypeSmall organic molecule
Emp. Form.C29H30N4O2
Mol. Mass.466.573
SMILESCOc1ccc2[nH]c3c[n+](CCCCC[n+]4ccc5c(c4)[nH]c4ccc(OC)cc54)ccc3c2c1