Reaction Details
TargetCholinesterase
LigandBDBM50317178
Substrate/Competitorn/a
Meas. Tech.ChEMBL_631312 (CHEMBL1105649)
IC50 4±n/a nM
Citation Rook, YSchmidtke, KUGaube, FSchepmann, DWünsch, BHeilmann, JLehmann, JWinckler, T Bivalent beta-carbolines as potential multitarget anti-Alzheimer agents. J Med Chem53:3611-7 (2010) 
 
Cholinesterase
Name:Cholinesterase
Type:Enzyme
Mol. Mass.:65643.35
Organism:Equus caballus (Horse)
Description:P81908
Residue:574
BDBM50317178
NameBDBM50317178
Synonyms:2-Methyl-9-[12-(2-methyl-beta-carboline-9-yl)dodecyl]-beta-carboline-2-ium iodide | CHEMBL1096994
TypeSmall organic molecule
Emp. Form.C36H44N4
Mol. Mass.532.7603
SMILESC[n+]1ccc2c(c1)n(CCCCCCCCCCCCn1c3ccccc3c3cc[n+](C)cc13)c1ccccc21