Reaction Details
TargetAcetylcholinesterase
LigandBDBM50317193
Substrate/Competitorn/a
Meas. Tech.ChEMBL_631311 (CHEMBL1103849)
IC50 27±n/a nM
Citation Rook, YSchmidtke, KUGaube, FSchepmann, DWünsch, BHeilmann, JLehmann, JWinckler, T Bivalent beta-carbolines as potential multitarget anti-Alzheimer agents. J Med Chem53:3611-7 (2010) 
 
Acetylcholinesterase
Name:Acetylcholinesterase
Type:Enzyme
Mol. Mass.:71812.79
Organism:Electrophorus electricus (Electric eel)
Description:n/a
Residue:633
BDBM50317193
NameBDBM50317193
Synonyms:2-Methyl-9-[9-(2-methyl-1,2,3,4-tetrahydro-beta-carboline-9-yl)nonyl]-1,2,3,4-tetrahydro-beta-carboline | CHEMBL1087459
TypeSmall organic molecule
Emp. Form.C33H44N4
Mol. Mass.496.7293
SMILESCN1CCc2c(C1)n(CCCCCCCCCn1c3CN(C)CCc3c3ccccc13)c1ccccc21