Reaction Details
TargetAcetylcholinesterase
LigandBDBM50317186
Substrate/Competitorn/a
Meas. Tech.ChEMBL_631311 (CHEMBL1103849)
IC50 595±n/a nM
Citation Rook, YSchmidtke, KUGaube, FSchepmann, DWünsch, BHeilmann, JLehmann, JWinckler, T Bivalent beta-carbolines as potential multitarget anti-Alzheimer agents. J Med Chem53:3611-7 (2010) 
 
Acetylcholinesterase
Name:Acetylcholinesterase
Type:Enzyme
Mol. Mass.:71812.79
Organism:Electrophorus electricus (Electric eel)
Description:n/a
Residue:633
BDBM50317186
NameBDBM50317186
Synonyms:2-[5-(beta-Carboline-2-ium-2-yl)pentyl]-beta-carboline-2-ium dibromide | CHEMBL1088354
TypeSmall organic molecule
Emp. Form.C27H26N4
Mol. Mass.406.521
SMILESC(CC[n+]1ccc2c(c1)[nH]c1ccccc21)CC[n+]1ccc2c(c1)[nH]c1ccccc21