Reaction Details
TargetCholinesterase
LigandBDBM50317189
Substrate/Competitorn/a
Meas. Tech.ChEMBL_631312 (CHEMBL1105649)
IC50 652±n/a nM
Citation Rook, YSchmidtke, KUGaube, FSchepmann, DWünsch, BHeilmann, JLehmann, JWinckler, T Bivalent beta-carbolines as potential multitarget anti-Alzheimer agents. J Med Chem53:3611-7 (2010) 
 
Cholinesterase
Name:Cholinesterase
Type:Enzyme
Mol. Mass.:65643.35
Organism:Equus caballus (Horse)
Description:P81908
Residue:574
BDBM50317189
NameBDBM50317189
Synonyms:2-[3-(beta-Carboline-2-ium-2-yl)propyl]-beta-carboline-2-ium dibromide | CHEMBL1088224
TypeSmall organic molecule
Emp. Form.C25H22N4
Mol. Mass.378.4679
SMILESC(C[n+]1ccc2c(c1)[nH]c1ccccc21)C[n+]1ccc2c(c1)[nH]c1ccccc21