Reaction Details
TargetAcetylcholinesterase
LigandBDBM50317190
Substrate/Competitorn/a
Meas. Tech.ChEMBL_631311 (CHEMBL1103849)
IC50 4261±n/a nM
Citation Rook, YSchmidtke, KUGaube, FSchepmann, DWünsch, BHeilmann, JLehmann, JWinckler, T Bivalent beta-carbolines as potential multitarget anti-Alzheimer agents. J Med Chem53:3611-7 (2010) 
 
Acetylcholinesterase
Name:Acetylcholinesterase
Type:Enzyme
Mol. Mass.:71812.79
Organism:Electrophorus electricus (Electric eel)
Description:n/a
Residue:633
BDBM50317190
NameBDBM50317190
Synonyms:6-Hydroxy-2-[5-(6-hydroxy-beta-carboline-2-ium-2-yl)pentyl]-beta-carboline-2-ium dibromide | CHEMBL1096868
TypeSmall organic molecule
Emp. Form.C27H26N4O2
Mol. Mass.438.5198
SMILESOc1ccc2[nH]c3c[n+](CCCCC[n+]4ccc5c(c4)[nH]c4ccc(O)cc54)ccc3c2c1