Reaction Details
TargetCholinesterase
LigandBDBM50317202
Substrate/Competitorn/a
Meas. Tech.ChEMBL_631312 (CHEMBL1105649)
IC50>1000±n/a nM
Citation Rook, YSchmidtke, KUGaube, FSchepmann, DWünsch, BHeilmann, JLehmann, JWinckler, T Bivalent beta-carbolines as potential multitarget anti-Alzheimer agents. J Med Chem53:3611-7 (2010) 
 
Cholinesterase
Name:Cholinesterase
Type:Enzyme
Mol. Mass.:65643.35
Organism:Equus caballus (Horse)
Description:P81908
Residue:574
BDBM50317202
NameBDBM50317202
Synonyms:9-[5-(beta-Carboline-9-yl)pentyl]-beta-carboline | CHEMBL1098470
TypeSmall organic molecule
Emp. Form.C27H24N4
Mol. Mass.404.5063
SMILESC(CCn1c2ccccc2c2ccncc12)CCn1c2ccccc2c2ccncc12