Reaction Details
TargetAcetylcholinesterase
LigandBDBM50317203
Substrate/Competitorn/a
Meas. Tech.ChEMBL_631311 (CHEMBL1103849)
IC50>10000±n/a nM
Citation Rook, YSchmidtke, KUGaube, FSchepmann, DWünsch, BHeilmann, JLehmann, JWinckler, T Bivalent beta-carbolines as potential multitarget anti-Alzheimer agents. J Med Chem53:3611-7 (2010) 
 
Acetylcholinesterase
Name:Acetylcholinesterase
Type:Enzyme
Mol. Mass.:71812.79
Organism:Electrophorus electricus (Electric eel)
Description:n/a
Residue:633
BDBM50317203
NameBDBM50317203
Synonyms:9-[9-(beta-Carboline-9-yl)nonyl]-beta-carboline | CHEMBL1098471
TypeSmall organic molecule
Emp. Form.C31H32N4
Mol. Mass.460.6126
SMILESC(CCCCn1c2ccccc2c2ccncc12)CCCCn1c2ccccc2c2ccncc12