Reaction Details
TargetProto-oncogene tyrosine-protein kinase Src
LigandBDBM50317229
Substrate/Competitorn/a
Meas. Tech.ChEMBL_631356 (CHEMBL1105693)
IC50 2.2±n/a nM
Citation Boschelli, DHWang, DWang, YWu, BHonores, EEBarrios Sosa, ACChaudhary, IGolas, JLucas, JBoschelli, F Optimization of 7-alkene-3-quinolinecarbonitriles as Src kinase inhibitors. Bioorg Med Chem Lett20:2924-7 (2010) 
 
Proto-oncogene tyrosine-protein kinase Src
Name:Proto-oncogene tyrosine-protein kinase Src
Type:Protein
Mol. Mass.:59838.60
Organism:Homo sapiens (Human)
Description:P12931
Residue:536
BDBM50317229
NameBDBM50317229
Synonyms:(E)-4-(2,4-dichloro-5-methoxyphenylamino)-7-(2-(5-((dimethylamino)methyl)pyridin-2-yl)vinyl)-6-methoxyquinoline-3-carbonitrile | CHEMBL1087215
TypeSmall organic molecule
Emp. Form.C28H25Cl2N5O2
Mol. Mass.534.436
SMILESCOc1cc(Nc2c(cnc3cc(\C=C\c4ccc(CN(C)C)cn4)c(OC)cc23)C#N)c(Cl)cc1Cl