Reaction Details
TargetProto-oncogene tyrosine-protein kinase Src
LigandBDBM50317233
Substrate/Competitorn/a
Meas. Tech.ChEMBL_631357 (CHEMBL1105694)
IC50 58±n/a nM
Citation Boschelli, DHWang, DWang, YWu, BHonores, EEBarrios Sosa, ACChaudhary, IGolas, JLucas, JBoschelli, F Optimization of 7-alkene-3-quinolinecarbonitriles as Src kinase inhibitors. Bioorg Med Chem Lett20:2924-7 (2010) 
 
Proto-oncogene tyrosine-protein kinase Src
Name:Proto-oncogene tyrosine-protein kinase Src
Type:Protein
Mol. Mass.:59838.60
Organism:Homo sapiens (Human)
Description:P12931
Residue:536
BDBM50317233
NameBDBM50317233
Synonyms:(E)-4-(2,4-dichloro-5-methoxyphenylamino)-6-methoxy-7-(4-(4-methylpiperazin-1-yl)but-1-enyl)quinoline-3-carbonitrile | CHEMBL1088240
TypeSmall organic molecule
Emp. Form.C27H29Cl2N5O2
Mol. Mass.526.457
SMILESCOc1cc(Nc2c(cnc3cc(\C=C\CCN4CCN(C)CC4)c(OC)cc23)C#N)c(Cl)cc1Cl