Reaction Details
TargetMacrophage-stimulating protein receptor
LigandBDBM50317339
Substrate/Competitorn/a
Meas. Tech.ChEMBL_631549 (CHEMBL1103914)
IC50 40±n/a nM
Citation Raeppel, SGaudette, FMannion, MClaridge, SSaavedra, OIsakovic, LDéziel, RBeaulieu, NBeaulieu, CDupont, INguyen, HWang, JMacleod, ARMaroun, CBesterman, JMVaisburg, A Identification of a novel series of potent RON receptor tyrosine kinase inhibitors. Bioorg Med Chem Lett20:2745-9 (2010) 
 
Macrophage-stimulating protein receptor
Name:Macrophage-stimulating protein receptor
Type:Protein
Mol. Mass.:152270.76
Organism:Homo sapiens (Human)
Description:Q04912
Residue:1400
BDBM50317339
NameBDBM50317339
Synonyms:6-(7-(2-fluoro-4-(1-phenyl-5-(trifluoromethyl)-1H-pyrazole-4-carboxamido)phenoxy)thieno[3,2-b]pyridin-2-yl)-N-(2-methoxyethyl)nicotinamide | CHEMBL1095360
TypeSmall organic molecule
Emp. Form.C33H24F4N6O4S
Mol. Mass.676.64
SMILESCOCCNC(=O)c1ccc(nc1)-c1cc2nccc(Oc3ccc(NC(=O)c4cnn(c4C(F)(F)F)-c4ccccc4)cc3F)c2s1