Reaction Details
TargetVascular endothelial growth factor receptor 2
LigandBDBM50306503
Substrate/Competitorn/a
Meas. Tech.ChEMBL_631551 (CHEMBL1103916)
IC50 10±n/a nM
Citation Raeppel, SGaudette, FMannion, MClaridge, SSaavedra, OIsakovic, LDéziel, RBeaulieu, NBeaulieu, CDupont, INguyen, HWang, JMacleod, ARMaroun, CBesterman, JMVaisburg, A Identification of a novel series of potent RON receptor tyrosine kinase inhibitors. Bioorg Med Chem Lett20:2745-9 (2010) 
 
Vascular endothelial growth factor receptor 2
Name:Vascular endothelial growth factor receptor 2
Type:Receptor Tyrosine Kinase
Mol. Mass.:151510.97
Organism:Homo sapiens (Human)
Description:P35968
Residue:1356
BDBM50306503
NameBDBM50306503
Synonyms:4,4,4-trifluoro-3-(3-fluoro-4-(2-(1-methyl-1H-imidazol-4-yl)thieno[3,2-b]pyridin-7-yloxy)phenylamino)-N-phenylbutanamide | CHEMBL602703
TypeSmall organic molecule
Emp. Form.C27H21F4N5O2S
Mol. Mass.555.547
SMILESCn1cnc(c1)-c1cc2nccc(Oc3ccc(NC(CC(=O)Nc4ccccc4)C(F)(F)F)cc3F)c2s1