Reaction Details
Target5-hydroxytryptamine receptor 1A
LigandBDBM50317420
Substrate/Competitorn/a
Meas. Tech.ChEMBL_631800 (CHEMBL1108193)
Ki 3590±n/a nM
Citation Nievergelt, AHuonker, PSchoop, RAltmann, KHGertsch, J Identification of serotonin 5-HT1A receptor partial agonists in ginger. Bioorg Med Chem18:3345-51 (2010) 
 
5-hydroxytryptamine receptor 1A
Name:5-hydroxytryptamine receptor 1A
Type:n/a
Mol. Mass.:46122.49
Organism:Homo sapiens (Human)
Description:n/a
Residue:422
BDBM50317420
NameBDBM50317420
Synonyms:1-Dehydro-10-gingerdione | CHEMBL1094100
TypeSmall organic molecule
Emp. Form.C21H30O4
Mol. Mass.346.4605
SMILESCCCCCCCCCC(=O)CC(=O)C=Cc1ccc(O)c(OC)c1