Reaction Details
Target5-hydroxytryptamine receptor 1A
LigandBDBM50317423
Substrate/Competitorn/a
Meas. Tech.ChEMBL_631800 (CHEMBL1108193)
Ki 5840±n/a nM
Citation Nievergelt, AHuonker, PSchoop, RAltmann, KHGertsch, J Identification of serotonin 5-HT1A receptor partial agonists in ginger. Bioorg Med Chem18:3345-51 (2010) 
 
5-hydroxytryptamine receptor 1A
Name:5-hydroxytryptamine receptor 1A
Type:n/a
Mol. Mass.:46122.49
Organism:Homo sapiens (Human)
Description:n/a
Residue:422
BDBM50317423
NameBDBM50317423
Synonyms:(E)-1-(4-Hydroxy-3-methoxy-phenyl)-tetradec-4-en-3-one CHEMBL24226
TypeSmall organic molecule
Emp. Form.C21H32O3
Mol. Mass.332.477
SMILESCCCCCCCCCC=CC(=O)CCc1ccc(O)c(OC)c1