Reaction Details
Target5-hydroxytryptamine receptor 1A
LigandBDBM50240419
Substrate/Competitorn/a
Meas. Tech.ChEMBL_631800 (CHEMBL1108193)
Ki 18020±n/a nM
Citation Nievergelt, AHuonker, PSchoop, RAltmann, KHGertsch, J Identification of serotonin 5-HT1A receptor partial agonists in ginger. Bioorg Med Chem18:3345-51 (2010) 
 
5-hydroxytryptamine receptor 1A
Name:5-hydroxytryptamine receptor 1A
Type:n/a
Mol. Mass.:46122.49
Organism:Homo sapiens (Human)
Description:n/a
Residue:422
BDBM50240419
NameBDBM50240419
Synonyms:(E)-1-(4-Hydroxy-3-methoxy-phenyl)-dec-4-en-3-one CHEMBL25948 [6]-shogaol | trans-6-shogaol
TypeSmall organic molecule
Emp. Form.C17H24O3
Mol. Mass.276.3707
SMILESCCCCCC=CC(=O)CCc1ccc(O)c(OC)c1