Reaction Details
TargetVoltage-dependent L-type calcium channel subunit alpha-1D
LigandBDBM50317834
Substrate/Competitorn/a
Meas. Tech.ChEMBL_629724 (CHEMBL1121084)
IC50 38±n/a nM
Citation Chang, CCCao, SKang, SKai, LTian, XPandey, PDunne, SFLuan, CHSurmeier, DJSilverman, RB Antagonism of 4-substituted 1,4-dihydropyridine-3,5-dicarboxylates toward voltage-dependent L-type Ca2+ channels Ca V 1.3 and Ca V 1.2. Bioorg Med Chem18:3147-58 (2010) 
 
Voltage-dependent L-type calcium channel subunit alpha-1D
Name:Voltage-dependent L-type calcium channel subunit alpha-1D
Type:PROTEIN
Mol. Mass.:250148.41
Organism:Rattus norvegicus
Description:ChEMBL_44709
Residue:2203
BDBM50317834
NameBDBM50317834
Synonyms:3-(4-(4-methoxyphenyl)butyl)5-methyl 2,6-dimethyl-4-(3-nitrophenyl)-1,4-dihydropyridine-3,5-dicarboxylate | CHEMBL1098841
TypeSmall organic molecule
Emp. Form.C27H30N2O7
Mol. Mass.494.5363
SMILESCOC(=O)C1C(C(C(=O)OCCCCc2ccc(OC)cc2)=C(C)N=C1C)c1cccc(c1)[N+]([O-])=O