Reaction Details
TargetAdenosine receptor A1
LigandBDBM50317881
Substrate/Competitorn/a
Meas. Tech.ChEMBL_630177 (CHEMBL1117280)
Ki 1290±n/a nM
Citation Devine, SMGregg, AFigler, HMcIntosh, KUrmaliya, VLinden, JPouton, CWWhite, PJBottle, SEScammells, PJ Synthesis and evaluation of new N6-substituted adenosine-5'-N-methylcarboxamides as A3 adenosine receptor agonists. Bioorg Med Chem18:3078-87 (2010) 
 
Adenosine receptor A1
Name:Adenosine receptor A1
Type:G Protein-Coupled Receptor (GPCR)
Mol. Mass.:36520.92
Organism:Homo sapiens (Human)
Description:P30542
Residue:326
BDBM50317881
NameBDBM50317881
Synonyms:CHEMBL1099127 | N6-(1,1,3,3-Tetramethylisoindolin-2-yloxyl-5-ylmethyl)adenosine-5'-N-methylcarboxamide
TypeSmall organic molecule
Emp. Form.C24H31N7O5
Mol. Mass.497.5468
SMILESCNC(=O)[C@H]1O[C@H]([C@H](O)[C@@H]1O)n1cnc2c(NCc3ccc4c(c3)C(C)(C)N(O)C4(C)C)ncnc12