Reaction Details
TargetAdenosine receptor A3
LigandBDBM50317873
Substrate/Competitorn/a
Meas. Tech.ChEMBL_630180 (CHEMBL1117283)
Ki 0.79±n/a nM
Citation Devine, SMGregg, AFigler, HMcIntosh, KUrmaliya, VLinden, JPouton, CWWhite, PJBottle, SEScammells, PJ Synthesis and evaluation of new N6-substituted adenosine-5'-N-methylcarboxamides as A3 adenosine receptor agonists. Bioorg Med Chem18:3078-87 (2010) 
 
Adenosine receptor A3
Name:Adenosine receptor A3
Type:G Protein-Coupled Receptor (GPCR)
Mol. Mass.:36197.32
Organism:Homo sapiens (Human)
Description:P0DMS8
Residue:318
BDBM50317873
NameBDBM50317873
Synonyms:(2R,3R,4S,5R)-2-(6-(2-hydroxy-1,1,3,3-tetramethylisoindolin-5-ylamino)-1H-purin-9(6H)-yl)-5-(hydroxymethyl)tetrahydrofuran-3,4-diol | CHEMBL1097549
TypeSmall organic molecule
Emp. Form.C22H30N6O5
Mol. Mass.458.5108
SMILESCC1(C)N(O)C(C)(C)c2cc(NC3NC=Nc4c3ncn4[C@@H]3O[C@H](CO)[C@@H](O)[C@H]3O)ccc12