Reaction Details
TargetAdenosine receptor A2a
LigandBDBM50317887
Substrate/Competitorn/a
Meas. Tech.ChEMBL_630178 (CHEMBL1117281)
Ki>10000±n/a nM
Citation Devine, SMGregg, AFigler, HMcIntosh, KUrmaliya, VLinden, JPouton, CWWhite, PJBottle, SEScammells, PJ Synthesis and evaluation of new N6-substituted adenosine-5'-N-methylcarboxamides as A3 adenosine receptor agonists. Bioorg Med Chem18:3078-87 (2010) 
 
Adenosine receptor A2a
Name:Adenosine receptor A2a
Type:G Protein-Coupled Receptor (GPCR)
Mol. Mass.:44716.46
Organism:Homo sapiens (Human)
Description:P29274
Residue:412
BDBM50317887
NameBDBM50317887
Synonyms:CHEMBL1094995 | N6-[4-[2-[3,5-di-tert-butylbenzamido]ethyl]phenyl]adenosine-5'-N-methylcarboxamide
TypeSmall organic molecule
Emp. Form.C34H43N7O5
Mol. Mass.629.7491
SMILESCNC(=O)[C@H]1O[C@H]([C@H](O)[C@@H]1O)n1cnc2c(Nc3ccc(CCNC(=O)c4cc(cc(c4)C(C)(C)C)C(C)(C)C)cc3)ncnc12