Reaction Details
TargetProstaglandin E2 receptor EP3 subtype
LigandBDBM50317908
Substrate/Competitorn/a
Meas. Tech.ChEMBL_630201 (CHEMBL1117304)
IC50 1.9±n/a nM
Citation Asada, MObitsu, TKinoshita, ANagase, TYoshida, TYamaura, YTakizawa, HYoshikawa, KSato, KNarita, MNakai, HToda, MTobe, Y 3-(2-Aminocarbonylphenyl)propanoic acid analogs as potent and selective EP3 receptor antagonists. Part 3: Synthesis, metabolic stability, and biological evaluation of optically active analogs. Bioorg Med Chem18:3212-23 (2010) 
 
Prostaglandin E2 receptor EP3 subtype
Name:Prostaglandin E2 receptor EP3 subtype
Type:G-protein coupled receptor
Mol. Mass.:40092.50
Organism:Mus musculus (Mouse)
Description:n/a
Residue:365
BDBM50317908
NameBDBM50317908
Synonyms:3-{2-({[(1R)-1-(3,5-Dimethylphenyl)-3-methylbutyl]-amino}carbonyl)-4-[(2-methylphenoxy)methyl]phenyl}-propanoic acid | CHEMBL1094157
TypeSmall organic molecule
Emp. Form.C31H37NO4
Mol. Mass.487.6298
SMILESCC(C)C[C@@H](NC(=O)c1cc(COc2ccccc2C)ccc1CCC(O)=O)c1cc(C)cc(C)c1