Reaction Details
TargetProstaglandin E2 receptor EP3 subtype
LigandBDBM50317910
Substrate/Competitorn/a
Meas. Tech.ChEMBL_630199 (CHEMBL1117302)
Ki 0.28±n/a nM
Citation Asada, MObitsu, TKinoshita, ANagase, TYoshida, TYamaura, YTakizawa, HYoshikawa, KSato, KNarita, MNakai, HToda, MTobe, Y 3-(2-Aminocarbonylphenyl)propanoic acid analogs as potent and selective EP3 receptor antagonists. Part 3: Synthesis, metabolic stability, and biological evaluation of optically active analogs. Bioorg Med Chem18:3212-23 (2010) 
 
Prostaglandin E2 receptor EP3 subtype
Name:Prostaglandin E2 receptor EP3 subtype
Type:G-protein coupled receptor
Mol. Mass.:40092.50
Organism:Mus musculus (Mouse)
Description:n/a
Residue:365
BDBM50317910
NameBDBM50317910
Synonyms:3-[4-[(3-Cyanophenoxy)methyl]-2-({[(1R)-1-(3,5-dimethylphenyl)-3-methylbutyl]amino}carbonyl)phenyl]propanoicacid | CHEMBL1095767
TypeSmall organic molecule
Emp. Form.C31H34N2O4
Mol. Mass.498.6127
SMILESCC(C)C[C@@H](NC(=O)c1cc(COc2cccc(c2)C#N)ccc1CCC(O)=O)c1cc(C)cc(C)c1