Reaction Details
TargetAldo-keto reductase family 1 member B1 [K65Q]
LigandBDBM50318053
Substrate/Competitorn/a
Meas. Tech.ChEMBL_631366 (CHEMBL1109118)
IC50 130±n/a nM
Citation Zou, XQPeng, SMHu, CPTan, LFYuan, QDeng, HWLi, YJ Synthesis, characterization and vasculoprotective effects of nitric oxide-donating derivatives of chrysin. Bioorg Med Chem18:3020-5 (2010) 
 
Aldo-keto reductase family 1 member B1 [K65Q]
Name:Aldo-keto reductase family 1 member B1 [K65Q]
Type:Protein
Mol. Mass.:35916.27
Organism:Bos taurus (Cattle)
Description:P16116[K65Q]
Residue:315
BDBM50318053
NameBDBM50318053
Synonyms:(5-hydroxy-4-oxo-2-phenyl-4H-chromen-7-yloxy)methyl 5-(nitrooxy)pentanoate | CHEMBL1095399
TypeSmall organic molecule
Emp. Form.C21H19NO9
Mol. Mass.429.3769
SMILESOc1cc(OCOC(=O)CCCCO[N+]([O-])=O)cc2oc(cc(=O)c12)-c1ccccc1