Reaction Details
TargetEpidermal growth factor receptor
LigandBDBM50318165
Substrate/Competitorn/a
Meas. Tech.ChEMBL_632393 (CHEMBL1115598)
IC50>200000±n/a nM
Citation Gangjee, ANamjoshi, OAIhnat, MABuchanan, A The contribution of a 2-amino group on receptor tyrosine kinase inhibition and antiangiogenic activity in 4-anilinosubstituted pyrrolo[2,3-d]pyrimidines. Bioorg Med Chem Lett20:3177-81 (2010) 
 
Epidermal growth factor receptor
Name:Epidermal growth factor receptor
Type:Receptor Kinase Domain
Mol. Mass.:134279.59
Organism:Homo sapiens (Human)
Description:P00533
Residue:1210
BDBM50318165
NameBDBM50318165
Synonyms:CHEMBL1096737 | N-(3-bromo-4-flurophenyl)-6-(2-phenylethyl)-7H-pyrrolo[2,3-d]pyrimidin-4-amine
TypeSmall organic molecule
Emp. Form.C20H16BrFN4
Mol. Mass.411.27
SMILESFc1ccc(Nc2ncnc3[nH]c(CCc4ccccc4)cc23)cc1Br