Reaction Details
TargetVascular endothelial growth factor receptor 1
LigandBDBM50318168
Substrate/Competitorn/a
Meas. Tech.ChEMBL_632394 (CHEMBL1115599)
IC50 223800±n/a nM
Citation Gangjee, ANamjoshi, OAIhnat, MABuchanan, A The contribution of a 2-amino group on receptor tyrosine kinase inhibition and antiangiogenic activity in 4-anilinosubstituted pyrrolo[2,3-d]pyrimidines. Bioorg Med Chem Lett20:3177-81 (2010) 
 
Vascular endothelial growth factor receptor 1
Name:Vascular endothelial growth factor receptor 1
Type:Receptor Tyrosine Kinase
Mol. Mass.:150800.23
Organism:Homo sapiens (Human)
Description:P17948
Residue:1338
BDBM50318168
NameBDBM50318168
Synonyms:CHEMBL1097368 | N-1H-indol-5-yl-6-(2-phenylethyl)-7H-pyrrolo[2,3-d]pyrimidin-4-amine
TypeSmall organic molecule
Emp. Form.C22H19N5
Mol. Mass.353.4198
SMILESC(Cc1ccccc1)c1cc2c(Nc3ccc4[nH]ccc4c3)ncnc2[nH]1