Reaction Details
TargetIntegrin alpha-L
LigandBDBM50318231
Substrate/Competitorn/a
Meas. Tech.ChEMBL_629042 (CHEMBL1120946)
IC50 4±n/a nM
Citation Watterson, SHXiao, ZDodd, DSTortolani, DRVaccaro, WPotin, DLaunay, MStetsko, DKSkala, SDavis, PMLee, DYang, XMcIntyre, KWBalimane, PPatel, KYang, ZMarathe, PKadiyala, PTebben, AJSheriff, SChang, CYZiemba, TZhang, HChen, BCDelMonte, AJAranibar, NMcKinnon, MBarrish, JCSuchard, SJMurali Dhar, TG Small molecule antagonist of leukocyte function associated antigen-1 (LFA-1): structure-activity relationships leading to the identification of 6-((5S,9R)-9-(4-cyanophenyl)-3-(3,5-dichlorophenyl)-1-methyl-2,4-dioxo-1,3,7-triazaspiro[4.4]nonan-7-yl)nicotinic acid (BMS-688521). J Med Chem53:3814-30 (2010) 
 
Integrin alpha-L
Name:Integrin alpha-L
Type:PROTEIN
Mol. Mass.:128748.90
Organism:Homo sapiens (Human)
Description:ChEMBL_629045
Residue:1170
BDBM50318231
NameBDBM50318231
Synonyms:2-((5S,9R)-9-(4-Cyanophenyl)-3-(3,5-dichlorophenyl)-1-methyl-2,4-dioxo-1,3,7-triazaspiro[4.4]nonan-7-yl)benzo[d]oxazole-5-carboxylic Acid | CHEMBL1094127
TypeSmall organic molecule
Emp. Form.C28H19Cl2N5O5
Mol. Mass.576.387
SMILESCN1C(=O)N(C(=O)[C@]11CN(C[C@H]1c1ccc(cc1)C#N)c1nc2cc(ccc2o1)C(O)=O)c1cc(Cl)cc(Cl)c1