Reaction Details
TargetAcetylcholinesterase
LigandBDBM9035
Substrate/Competitorn/a
Meas. Tech.ChEMBL_633769 (CHEMBL1119333)
IC50 0.2±n/a nM
Citation Lv, WXue, Y Prediction of acetylcholinesterase inhibitors and characterization of correlative molecular descriptors by machine learning methods. Eur J Med Chem45:1167-72 (2010) 
 
Acetylcholinesterase
Name:Acetylcholinesterase
Type:Enzyme
Mol. Mass.:67792.70
Organism:Homo sapiens (Human)
Description:P22303
Residue:614
BDBM9035
NameBDBM9035
Synonyms:Indole-Tacrine Heterodimer 18 N-{7-[(6-chloro-1,2,3,4-tetrahydroacridin-9-yl)amino]heptyl}-2-(1H-indol-3-yl)acetamide
TypeSmall organic molecule
Emp. Form.C30H35ClN4O
Mol. Mass.503.078
SMILESClc1ccc2c(NCCCCCCCNC(=O)Cc3c[nH]c4ccccc34)c3CCCCc3nc2c1