Reaction Details
TargetAcetylcholinesterase
LigandBDBM50034002
Substrate/Competitorn/a
Meas. Tech.ChEMBL_633769 (CHEMBL1119333)
IC50 6.8±n/a nM
Citation Lv, WXue, Y Prediction of acetylcholinesterase inhibitors and characterization of correlative molecular descriptors by machine learning methods. Eur J Med Chem45:1167-72 (2010) 
 
Acetylcholinesterase
Name:Acetylcholinesterase
Type:Enzyme
Mol. Mass.:67792.70
Organism:Homo sapiens (Human)
Description:P22303
Residue:614
BDBM50034002
NameBDBM50034002
Synonyms:3-(1-Benzyl-piperidin-4-yl)-1-(2-methyl-benzothiazol-6-yl)-propan-1-one; hydrochloride CHEMBL542543
TypeSmall organic molecule
Emp. Form.C23H26N2OS
Mol. Mass.378.53
SMILESCc1nc2ccc(cc2s1)C(=O)CCC1CCN(Cc2ccccc2)CC1