Reaction Details
TargetHistone deacetylase 1
LigandBDBM50319223
Substrate/Competitorn/a
Meas. Tech.ChEMBL_633815 (CHEMBL1119893)
IC50 11500±n/a nM
Citation Wang, HLim, ZYZhou, YNg, MLu, TLee, KSangthongpitag, KGoh, KCWang, XWu, XKhng, HHGoh, SKOng, WCBonday, ZSun, ET Acylurea connected straight chain hydroxamates as novel histone deacetylase inhibitors: Synthesis, SAR, and in vivo antitumor activity. Bioorg Med Chem Lett20:3314-21 (2010) 
 
Histone deacetylase 1
Name:Histone deacetylase 1
Type:Enzyme
Mol. Mass.:55090.27
Organism:Homo sapiens (Human)
Description:Q13547
Residue:482
BDBM50319223
NameBDBM50319223
Synonyms:6-{3-[4-(4-Methyl-piperazin-1-yl)-3-nitro-benzoyl]-ureido}-hexanoic acid hydroxyamide | CHEMBL1084340
TypeSmall organic molecule
Emp. Form.C19H28N6O6
Mol. Mass.436.4622
SMILESCN1CCN(CC1)c1ccc(cc1[N+]([O-])=O)C(=O)NC(=O)NCCCCCC(=O)NO