Reaction Details
TargetHistone deacetylase 1
LigandBDBM50319225
Substrate/Competitorn/a
Meas. Tech.ChEMBL_633815 (CHEMBL1119893)
IC50 2420±n/a nM
Citation Wang, HLim, ZYZhou, YNg, MLu, TLee, KSangthongpitag, KGoh, KCWang, XWu, XKhng, HHGoh, SKOng, WCBonday, ZSun, ET Acylurea connected straight chain hydroxamates as novel histone deacetylase inhibitors: Synthesis, SAR, and in vivo antitumor activity. Bioorg Med Chem Lett20:3314-21 (2010) 
 
Histone deacetylase 1
Name:Histone deacetylase 1
Type:Enzyme
Mol. Mass.:55090.27
Organism:Homo sapiens (Human)
Description:Q13547
Residue:482
BDBM50319225
NameBDBM50319225
Synonyms:6-{3-[3-nitro-4-(2-pyrrolidin-1-yl-ethylamino)-benzoyl]-ureido}-hexanoic acidhydroxyamide | CHEMBL1084342
TypeSmall organic molecule
Emp. Form.C20H30N6O6
Mol. Mass.450.4888
SMILESONC(=O)CCCCCNC(=O)NC(=O)c1ccc(NCCN2CCCC2)c(c1)[N+]([O-])=O