Reaction Details
TargetHistone deacetylase 2
LigandBDBM50319235
Substrate/Competitorn/a
Meas. Tech.ChEMBL_633817 (CHEMBL1119895)
Ki 44±n/a nM
Citation Wang, HLim, ZYZhou, YNg, MLu, TLee, KSangthongpitag, KGoh, KCWang, XWu, XKhng, HHGoh, SKOng, WCBonday, ZSun, ET Acylurea connected straight chain hydroxamates as novel histone deacetylase inhibitors: Synthesis, SAR, and in vivo antitumor activity. Bioorg Med Chem Lett20:3314-21 (2010) 
 
Histone deacetylase 2
Name:Histone deacetylase 2
Type:Chromatin regulator; hydrolase; repressor
Mol. Mass.:55356.54
Organism:Homo sapiens (Human)
Description:Q92769
Residue:488
BDBM50319235
NameBDBM50319235
Synonyms:6-(3-Benzoyl-ureido)-hexanoic acid hydroxyamide | CHEMBL1083439
TypeSmall organic molecule
Emp. Form.C14H19N3O4
Mol. Mass.293.3184
SMILESONC(=O)CCCCCNC(=O)NC(=O)c1ccccc1